{"text_format":"1","workbook":"xlsx","n_sheets":5,"sheets":["3+1 Estimator","1+1 Estimator","Sheet1","Wire Types","Constant and Variable Data"],"not_rendered":{"charts":0,"images":2,"macros":1,"external_links":0,"defined_names":8,"comments":0,"pivot_tables":0},"unopened":[],"bounds":{"document_bytes":16777216,"sheet_cells":100000,"rows_first":2000,"rows_last":500,"rows_between":2000,"halvings":0,"cell_chars":16384,"cell_head_chars":4096},"cells_cut":0,"cells_raw":0,"read":"whole","date_system":"1900"}

{"sheet":"3+1 Estimator","index":0,"n_rows":78,"n_cols":8,"rows_kept":78,"cut":false,"hidden":false,"merged":[[39,2,39,5],[40,2,41,6],[42,2,42,6],[43,2,45,2],[43,3,45,3],[43,4,45,4],[43,5,45,5],[43,6,45,6],[50,3,50,6],[51,3,51,4],[51,5,51,6],[52,3,52,4],[52,5,52,6],[56,6,58,6],[64,3,64,6],[55,3,55,7],[65,3,67,3],[65,4,67,4],[65,5,67,5],[65,6,67,6],[56,7,58,7],[37,8,48,10],[13,6,15,6],[22,2,23,6],[24,2,24,5],[25,2,26,6],[27,2,27,6],[28,2,30,2],[37,2,38,6],[28,3,30,3],[28,4,30,4],[28,5,30,5],[28,6,30,6],[22,8,33,10],[13,2,15,2],[13,3,15,3],[13,4,15,4],[1,4,1,5],[61,2,61,4],[63,2,63,4],[70,2,70,6],[71,2,72,6],[4,2,4,7],[9,2,9,5],[10,2,11,6],[12,2,12,6],[13,5,15,5],[1,2,2,3],[2,4,2,6],[7,2,8,6],[56,3,58,3],[56,4,58,4],[56,5,58,5]]}
[]
[null,null,null,null,"  JOB/ORDER:___________________",null,"DATE:__________"]
[null,null,null,null," CUSTOMER:____________________________________"]
[]
[null,null,"3+1 Estimator"]
[]
[]
[null,null,"Step 1: Choose Your Wire Type for 1st Run In Yellow Box"]
[]
[null,null,"Type of Wire - 1st Run",null,null,null,"SELECT"]
[null,null,"Step 2: Choose Your Wire Gauge and Enter Wire Length For Each Compartment In Yellow Boxes"]
[]
[null,null," Gauge and Length of Wire - 1st Run"]
[null,null,"Reel Compartment","#1","#2","#3","#4 (Free-Spinning)"]
[]
[]
[null,null,"Wire Gauge","EMPTY","EMPTY","EMPTY","EMPTY"]
[null,null,"Estimated Maximum Length (Ft)",{"$f":"'Constant and Variable Data'!M2","v":4.0336362129898262E+20},{"$f":"'Constant and Variable Data'!N2","v":4.0336362129898262E+20},{"$f":"'Constant and Variable Data'!O2","v":4.0336362129898262E+20},{"$f":"'Constant and Variable Data'!P2","v":4.0336362129898262E+20}]
[null,null,"Wire Length (Ft) Must Be Lower Than Maximum Length"]
[]
{"$rows_left_out":59}
{"sheet":"1+1 Estimator","index":1,"n_rows":83,"n_cols":9,"rows_kept":83,"cut":false,"hidden":false,"merged":[[1,2,2,3],[1,4,1,6],[2,4,2,7],[7,2,8,7],[7,9,20,11],[9,2,9,7],[12,2,13,7],[15,7,17,7],[4,2,4,7],[24,9,37,11],[32,7,34,7],[41,9,54,11],[49,7,51,7],[14,2,14,7],[15,2,17,2],[15,3,17,3],[15,4,17,4],[15,5,17,5],[15,6,17,6],[24,2,25,7],[26,2,26,7],[29,2,30,7],[31,2,31,7],[32,2,34,2],[32,3,34,3],[32,4,34,4],[32,5,34,5],[32,6,34,6],[41,2,42,7],[43,2,43,7],[46,2,47,7],[48,2,48,7],[49,2,51,2],[49,3,51,3],[49,6,51,6],[49,4,51,4],[49,5,51,5],[61,3,63,3],[61,4,63,4],[61,5,63,5],[61,6,63,6],[56,3,56,6],[57,3,57,4],[57,5,57,6],[58,5,58,6],[60,2,60,7],[58,3,58,4],[79,4,79,5],[80,4,80,5],[81,4,81,5],[82,4,82,5],[61,7,63,7],[70,6,72,6],[75,2,75,7],[76,2,77,7],[66,2,66,5],[68,2,68,5],[69,2,69,6],[70,2,72,2],[70,3,72,3],[70,4,72,4],[70,5,72,5],[61,2,63,2]]}
[]
[null,null,null,null,"    JOB/ORDER:_____________________________________",null,null,"DATE:___________"]
[null,null,null,null,"   CUSTOMER:_______________________________________________________"]
[]
[null,null,"1+1 Estimator"]
[]
[]
[null,null,"Step 1: Choose Your Wire Type for 1st Run In Yellow Boxes"]
[]
[null,null,"Types of Wire - 1st Run"]
[null,null,"Number of Wires (Parallel)","Wire #1","Wire #2","Wire #3","Wire #4","Wire #5 (Free-Spinning)"]
[null,null,"Wire Type","SELECT","SELECT","SELECT","SELECT","SELECT"]
[null,null,"Step 2: Choose Your Wire Gauge and Enter Wire Length For Each Compartment In Yellow Boxes"]
[]
[null,null," Gauge and Length of Wire - 1st Run"]
[null,null,"Number of Wires (Parallel)","Wire #1","Wire #2","Wire #3","Wire #4","Wire #5 (Free-Spinning)"]
[]
[]
[null,null,"Wire Gauge","EMPTY","EMPTY","EMPTY","EMPTY","EMPTY"]
[null,null,"Estimated Maximum Length (Ft)",{"$f":"'Constant and Variable Data'!M18","v":1.2608556513579906E+21},{"$f":"'Constant and Variable Data'!N18","v":1.2608556513579906E+21},{"$f":"'Constant and Variable Data'!O18","v":1.2608556513579906E+21},{"$f":"'Constant and Variable Data'!P18","v":1.2608556513579906E+21},{"$f":"'Constant and Variable Data'!Q18","v":4.0336362129898262E+20}]
{"$rows_left_out":64}
{"sheet":"Sheet1","index":2,"n_rows":36,"n_cols":7,"rows_kept":36,"cut":false,"hidden":true,"merged":[[1,1,3,6],[5,1,5,5],[7,1,7,5],[8,1,10,1],[8,2,10,2],[8,3,10,3],[8,4,10,4],[8,5,10,5],[13,1,13,5],[15,1,15,5],[16,1,18,4],[16,5,18,5],[19,1,19,4],[21,1,21,4],[26,1,28,4],[29,1,29,4],[31,1,31,5],[32,1,34,4],[32,5,34,5],[35,1,35,4],[22,1,22,2],[22,3,22,4],[23,1,23,2],[23,3,23,4],[25,1,25,6],[26,5,28,5],[26,6,28,6]]}
[]
[null,"ReelRover 1+1 Configuration - Wire Loading Estimator"]
[]
[]
[]
[null,"Enter Length of Each Wire In the Compartments (Feet) in Yellow Box Below (leave blank if not applicable):"]
[]
[null,"Length of Wire"]
[null,"Length of 1st Wire in Compartment","Length of 2nd Wire in Compartment","Length of 3rd Wire in Compartment","Length of 4th Wire in Compartment","Length of Wire in Free-Spinning Compartment "]
[]
[]
[null,284,284,284,284,262]
[]
[null,"Click Yellow Box Below to Select Type of Wire from Drop-Down List:"]
[]
[null,"Type of Wire"]
[null,"Type of Wire in Compartment #1",null,null,null,"Ground Wire in Compartment #2              (Free-Spinning)"]
[]
[]
[null,"Copper 600 THHN",null,null,null,"Copper 600 THHN"]
{"$rows_left_out":17}
{"sheet":"Wire Types","index":3,"n_rows":154,"n_cols":7,"rows_kept":154,"cut":false,"hidden":true,"merged":[]}
["Wire Type",null,null,null,"CopperTHHN Wire Gauge","Single Wire Diameter","Wire Weight /1000'"]
["CopperTHHN",null,null,null,"8 AWG THHN CU",0.216,61]
["CopperXHHW",null,null,null,"6 AWG THHN CU",0.254,93]
["AluminumTHHN",null,null,null,"4 AWG THHN CU",0.32400000000000001,149.11000000000001]
["AluminumXHHW",null,null,null,"3 AWG THHN CU",0.36199999999999999,184]
["CU_MC_Circuit",null,null,null,"2 AWG THHN CU",0.38400000000000001,225.08]
["CU_MC_Intermediate_and_Feeder",null,null,null,"1 AWG THHN CU",0.44600000000000001,287.99]
["AL_MC_Intermediate_and_Feeder",null,null,null,"1/0 AWG THHN CU",0.48599999999999999,356.74]
["SELECT",null,null,null,"2/0 AWG THHN CU",0.53200000000000003,441.14]
[null,null,null,null,"3/0 AWG THHN CU",0.58399999999999996,550.45000000000005]
[null,null,null,null,"4/0 AWG THHN CU",0.64200000000000002,692.2]
[null,null,null,null,"250 MCM THHN CU",0.71099999999999997,824.8]
[null,null,null,null,"300 MCM THHN CU",0.76600000000000001,984.5]
[null,null,null,null,"350 MCM THHN CU",0.81699999999999995,1142.27]
[null,null,null,null,"400 MCM THHN CU",0.86399999999999999,1296.06]
[null,null,null,null,"500 MCM THHN CU",0.94899999999999995,1598.67]
[null,null,null,null,"600 MCM THHN CU",1.0509999999999999,1933.88]
[null,null,null,null,"750 MCM THHN CU",1.1559999999999999,2423.79]
[null,null,null,null,"EMPTY",1.0000000000000001E-9,1E-8]
[null,null,null,null,"CopperXHHW Wire Gauge","Single Wire Diameter","Wire Weight /1000'"]
{"$rows_left_out":135}
{"sheet":"Constant and Variable Data","index":4,"n_rows":31,"n_cols":17,"rows_kept":31,"cut":false,"hidden":true,"merged":[[17,0,17,7],[22,0,22,7],[27,0,27,7],[0,0,0,7],[1,0,1,7],[6,0,6,7],[11,0,11,7],[16,0,16,7]]}
["ReelRover v3.6 3+1 Configuration",null,null,null,null,null,null,null,null,null,null,null,"Length Capactiy #1","Length Capacity #2","Length Capacity #3","Length Capacity #4"]
["1ST RUN",null,null,null,null,null,null,null,null,null,null,"Total Available",{"$f":"3.14159/12*(+'Constant and Variable Data'!G4+(TRUNC(('Constant and Variable Data'!F4-(2*0)-'Constant and Variable Data'!G4)/(1.9*'Constant and Variable Data'!B4))*(0.95*'Constant and Variable Data'!B4)))*TRUNC(('Constant and Variable Data'!F4-2*0-'Constant and Variable Data'!G4)/(1.9*'Constant and Variable Data'!B4))*TRUNC(0.85*'Constant and Variable Data'!H4/'Constant and Variable Data'!B4)","v":4.0336362129898262E+20},{"$f":"3.14159/12*(+'Constant and Variable Data'!G4+(TRUNC(('Constant and Variable Data'!F4-(2*0)-'Constant and Variable Data'!G4)/(1.9*'Constant and Variable Data'!C4))*(0.95*'Constant and Variable Data'!C4)))*TRUNC(('Constant and Variable Data'!F4-2*0-'Constant and Variable Data'!G4)/(1.9*'Constant and Variable Data'!C4))*TRUNC(0.85*'Constant and Variable Data'!H4/'Constant and Variable Data'!C4)","v":4.0336362129898262E+20},{"$f":"3.14159/12*(+'Constant and Variable Data'!G4+(TRUNC(('Constant and Variable Data'!F4-(2*0)-'Constant and Variable Data'!G4)/(1.9*'Constant and Variable Data'!D4))*(0.95*'Constant and Variable Data'!D4)))*TRUNC(('Constant and Variable Data'!F4-2*0-'Constant and Variable Data'!G4)/(1.9*'Constant and Variable Data'!D4))*TRUNC(0.85*'Constant and Variable Data'!H4/'Constant and Variable Data'!D4)","v":4.0336362129898262E+20},{"$f":"3.14159/12*(+'Constant and Variable Data'!G4+(TRUNC(('Constant and Variable Data'!F4-(2*0)-'Constant and Variable Data'!G4)/(1.9*'Constant and Variable Data'!E4))*(0.95*'Constant and Variable Data'!E4)))*TRUNC(('Constant and Variable Data'!F4-2*0-'Constant and Variable Data'!G4)/(1.9*'Constant and Variable Data'!E4))*TRUNC(0.85*'Constant and Variable Data'!H4/'Constant and Variable Data'!E4)","v":4.0336362129898262E+20}]
[null,"Selected Wire Diameter Compartment #1","Selected Wire Diameter Compartment #2","Selected Wire Diameter Compartment #3","Selected Wire Diameter Compartment #4","Flange","Drum","Traverse ",null,null,null,"Length 1 Entered",{"$f":"'3+1 Estimator'!D19","v":0},{"$f":"'3+1 Estimator'!E19","v":0},{"$f":"'3+1 Estimator'!F19","v":0},{"$f":"'3+1 Estimator'!G19","v":0}]
["Wire Diameter",{"$f":"VLOOKUP('3+1 Estimator'!D17,'Wire Types'!E1:G154,2,FALSE)","v":1.0000000000000001E-9},{"$f":"VLOOKUP('3+1 Estimator'!E17,'Wire Types'!E1:G154,2,FALSE)","v":1.0000000000000001E-9},{"$f":"VLOOKUP('3+1 Estimator'!F17,'Wire Types'!E1:G154,2,FALSE)","v":1.0000000000000001E-9},{"$f":"VLOOKUP('3+1 Estimator'!G17,'Wire Types'!E1:G154,2,FALSE)","v":1.0000000000000001E-9},40,16,5.125,null,null,null,"% Occupied by 1",{"$f":"SUM(M3/M2)","v":0},0,0,0]
["Wire Weight/FT",{"$f":"VLOOKUP('3+1 Estimator'!D17,'Wire Types'!E1:G154,3,FALSE)/1000","v":1.0000000000000001E-11},{"$f":"VLOOKUP('3+1 Estimator'!E17,'Wire Types'!E1:G154,3,FALSE)/1000","v":1.0000000000000001E-11},{"$f":"VLOOKUP('3+1 Estimator'!F17,'Wire Types'!E1:G154,3,FALSE)/1000","v":1.0000000000000001E-11},{"$f":"VLOOKUP('3+1 Estimator'!G17,'Wire Types'!E1:G154,3,FALSE)/1000","v":1.0000000000000001E-11},null,null,null,null,null,null,"% Available",{"$f":"SUM(1-M4)","v":1},1,1,1]
[null,null,null,null,null,null,null,null,null,null,null,"Total",{"$f":"3.14159/12*(+'Constant and Variable Data'!G4+(TRUNC(('Constant and Variable Data'!F4-(2*0)-'Constant and Variable Data'!G4)/(1.9*'Constant and Variable Data'!B9))*(0.95*'Constant and Variable Data'!B9)))*TRUNC(('Constant and Variable Data'!F4-2*0-'Constant and Variable Data'!G4)/(1.9*'Constant and Variable Data'!B9))*TRUNC(0.85*'Constant and Variable Data'!H4/'Constant and Variable Data'!B9)","v":4.0336362129898262E+20},{"$f":"3.14159/12*(+'Constant and Variable Data'!G4+(TRUNC(('Constant and Variable Data'!F4-(2*0)-'Constant and Variable Data'!G4)/(1.9*'Constant and Variable Data'!C9))*(0.95*'Constant and Variable Data'!C9)))*TRUNC(('Constant and Variable Data'!F4-2*0-'Constant and Variable Data'!G4)/(1.9*'Constant and Variable Data'!C9))*TRUNC(0.85*'Constant and Variable Data'!H4/'Constant and Variable Data'!C9)","v":4.0336362129898262E+20},{"$f":"3.14159/12*(+'Constant and Variable Data'!G4+(TRUNC(('Constant and Variable Data'!F4-(2*0)-'Constant and Variable Data'!G4)/(1.9*'Constant and Variable Data'!D9))*(0.95*'Constant and Variable Data'!D9)))*TRUNC(('Constant and Variable Data'!F4-2*0-'Constant and Variable Data'!G4)/(1.9*'Constant and Variable Data'!D9))*TRUNC(0.85*'Constant and Variable Data'!H4/'Constant and Variable Data'!D9)","v":4.0336362129898262E+20},{"$f":"3.14159/12*(+'Constant and Variable Data'!G4+(TRUNC(('Constant and Variable Data'!F4-(2*0)-'Constant and Variable Data'!G4)/(1.9*'Constant and Variable Data'!E9))*(0.95*'Constant and Variable Data'!E9)))*TRUNC(('Constant and Variable Data'!F4-2*0-'Constant and Variable Data'!G4)/(1.9*'Constant and Variable Data'!E9))*TRUNC(0.85*'Constant and Variable Data'!H4/'Constant and Variable Data'!E9)","v":4.0336362129898262E+20}]
["2ND RUN",null,null,null,null,null,null,null,null,null,null,"Total Available",{"$f":"SUM(M6*M5)","v":4.0336362129898262E+20},4.0336362129898262E+20,4.0336362129898262E+20,4.0336362129898262E+20]
[null,"Selected Wire Diameter Compartment #1","Selected Wire Diameter Compartment #2","Selected Wire Diameter Compartment #3","Selected Wire Diameter Compartment #4",null,null,null,null,null,null,"Length 2 Entered",{"$f":"'3+1 Estimator'!D34","v":0},{"$f":"'3+1 Estimator'!E34","v":0},{"$f":"'3+1 Estimator'!F34","v":0},{"$f":"'3+1 Estimator'!G34","v":0}]
["Wire Diameter",{"$f":"VLOOKUP('3+1 Estimator'!D32,'Wire Types'!E1:G154,2,FALSE)","v":1.0000000000000001E-9},{"$f":"VLOOKUP('3+1 Estimator'!E32,'Wire Types'!E1:G154,2,FALSE)","v":1.0000000000000001E-9},{"$f":"VLOOKUP('3+1 Estimator'!F32,'Wire Types'!E1:G154,2,FALSE)","v":1.0000000000000001E-9},{"$f":"VLOOKUP('3+1 Estimator'!G32,'Wire Types'!E1:G154,2,FALSE)","v":1.0000000000000001E-9},null,null,null,null,null,null,"% Occupied by 2",{"$f":"SUM(M8/M6)","v":0},0,0,0]
["Wire Weight/FT",{"$f":"VLOOKUP('3+1 Estimator'!D32,'Wire Types'!E1:G154,3,FALSE)/1000","v":1.0000000000000001E-11},{"$f":"VLOOKUP('3+1 Estimator'!E32,'Wire Types'!E1:G154,3,FALSE)/1000","v":1.0000000000000001E-11},{"$f":"VLOOKUP('3+1 Estimator'!F32,'Wire Types'!E1:G154,3,FALSE)/1000","v":1.0000000000000001E-11},{"$f":"VLOOKUP('3+1 Estimator'!G32,'Wire Types'!E1:G154,3,FALSE)/1000","v":1.0000000000000001E-11},null,null,null,null,null,null,"% Available",{"$f":"SUM(1-(M9+M4))","v":1},1,1,1]
[null,null,null,null,null,null,null,null,null,null,null,"Total",{"$f":"3.14159/12*(+'Constant and Variable Data'!G4+(TRUNC(('Constant and Variable Data'!F4-(2*0)-'Constant and Variable Data'!G4)/(1.9*'Constant and Variable Data'!B14))*(0.95*'Constant and Variable Data'!B14)))*TRUNC(('Constant and Variable Data'!F4-2*0-'Constant and Variable Data'!G4)/(1.9*'Constant and Variable Data'!B14))*TRUNC(0.85*'Constant and Variable Data'!H4/'Constant and Variable Data'!B14)","v":4.0336362129898262E+20},{"$f":"3.14159/12*(+'Constant and Variable Data'!G4+(TRUNC(('Constant and Variable Data'!F4-(2*0)-'Constant and Variable Data'!G4)/(1.9*'Constant and Variable Data'!C14))*(0.95*'Constant and Variable Data'!C14)))*TRUNC(('Constant and Variable Data'!F4-2*0-'Constant and Variable Data'!G4)/(1.9*'Constant and Variable Data'!C14))*TRUNC(0.85*'Constant and Variable Data'!H4/'Constant and Variable Data'!C14)","v":4.0336362129898262E+20},{"$f":"3.14159/12*(+'Constant and Variable Data'!G4+(TRUNC(('Constant and Variable Data'!F4-(2*0)-'Constant and Variable Data'!G4)/(1.9*'Constant and Variable Data'!D14))*(0.95*'Constant and Variable Data'!D14)))*TRUNC(('Constant and Variable Data'!F4-2*0-'Constant and Variable Data'!G4)/(1.9*'Constant and Variable Data'!D14))*TRUNC(0.85*'Constant and Variable Data'!H4/'Constant and Variable Data'!D14)","v":4.0336362129898262E+20},{"$f":"3.14159/12*(+'Constant and Variable Data'!G4+(TRUNC(('Constant and Variable Data'!F4-(2*0)-'Constant and Variable Data'!G4)/(1.9*'Constant and Variable Data'!E14))*(0.95*'Constant and Variable Data'!E14)))*TRUNC(('Constant and Variable Data'!F4-2*0-'Constant and Variable Data'!G4)/(1.9*'Constant and Variable Data'!E14))*TRUNC(0.85*'Constant and Variable Data'!H4/'Constant and Variable Data'!E14)","v":4.0336362129898262E+20}]
["3RD RUN",null,null,null,null,null,null,null,null,null,null,"Total Available",{"$f":"SUM(M10*M11)","v":4.0336362129898262E+20},4.0336362129898262E+20,4.0336362129898262E+20,4.0336362129898262E+20]
[null,"Selected Wire Diameter Compartment #1","Selected Wire Diameter Compartment #2","Selected Wire Diameter Compartment #3","Selected Wire Diameter Compartment #4",null,null,null,null,null,null,"Length 3 Entered",{"$f":"'3+1 Estimator'!D49","v":0},{"$f":"'3+1 Estimator'!E49","v":0},{"$f":"'3+1 Estimator'!F49","v":0},{"$f":"'3+1 Estimator'!G49","v":0}]
["Wire Diameter",{"$f":"VLOOKUP('3+1 Estimator'!D47,'Wire Types'!E1:G154,2,FALSE)","v":1.0000000000000001E-9},{"$f":"VLOOKUP('3+1 Estimator'!E47,'Wire Types'!E1:G154,2,FALSE)","v":1.0000000000000001E-9},{"$f":"VLOOKUP('3+1 Estimator'!F47,'Wire Types'!E1:G154,2,FALSE)","v":1.0000000000000001E-9},{"$f":"VLOOKUP('3+1 Estimator'!G47,'Wire Types'!E1:G154,2,FALSE)","v":1.0000000000000001E-9},null,null,null,null,null,null,"% Occupied by 3",{"$f":"SUM(M13/M11)","v":0},0,0,0]
["Wire Weight/FT",{"$f":"VLOOKUP('3+1 Estimator'!D47,'Wire Types'!E1:G154,3,FALSE)/1000","v":1.0000000000000001E-11},{"$f":"VLOOKUP('3+1 Estimator'!E47,'Wire Types'!E1:G154,3,FALSE)/1000","v":1.0000000000000001E-11},{"$f":"VLOOKUP('3+1 Estimator'!F47,'Wire Types'!E1:G154,3,FALSE)/1000","v":1.0000000000000001E-11},{"$f":"VLOOKUP('3+1 Estimator'!G47,'Wire Types'!E1:G154,3,FALSE)/1000","v":1.0000000000000001E-11},null,null,null,null,null,null,"Total % Occupied",{"$f":"ROUNDDOWN(SUM(M14+M9+M4),3)","v":0},0,0,0]
[]
["ReelRover v3.6 1+1 Configuration",null,null,null,null,null,null,null,null,null,null,null,"Length Capactiy #1","Length Capacity #2","Length Capacity #3","Length Capacity #4","Length Capacity #5"]
["1ST RUN",null,null,null,null,null,null,null,null,null,null,"Total Available",{"$f":"3.14159/12*(+'Constant and Variable Data'!H20+(TRUNC(('Constant and Variable Data'!G20-(2*0)-'Constant and Variable Data'!H20)/(1.9*'Constant and Variable Data'!B20))*(0.95*'Constant and Variable Data'!B20)))*TRUNC(('Constant and Variable Data'!G20-2*0-'Constant and Variable Data'!H20)/(1.9*'Constant and Variable Data'!B20))*TRUNC(0.85*'Constant and Variable Data'!I20/'Constant and Variable Data'!B20)/K24","v":1.2608556513579906E+21},{"$f":"3.14159/12*(+'Constant and Variable Data'!H20+(TRUNC(('Constant and Variable Data'!G20-(2*0)-'Constant and Variable Data'!H20)/(1.9*'Constant and Variable Data'!C20))*(0.95*'Constant and Variable Data'!C20)))*TRUNC(('Constant and Variable Data'!G20-2*0-'Constant and Variable Data'!H20)/(1.9*'Constant and Variable Data'!C20))*TRUNC(0.85*'Constant and Variable Data'!I20/'Constant and Variable Data'!C20)/K24","v":1.2608556513579906E+21},{"$f":"3.14159/12*(+'Constant and Variable Data'!H20+(TRUNC(('Constant and Variable Data'!G20-(2*0)-'Constant and Variable Data'!H20)/(1.9*'Constant and Variable Data'!D20))*(0.95*'Constant and Variable Data'!D20)))*TRUNC(('Constant and Variable Data'!G20-2*0-'Constant and Variable Data'!H20)/(1.9*'Constant and Variable Data'!D20))*TRUNC(0.85*'Constant and Variable Data'!I20/'Constant and Variable Data'!D20)/K24","v":1.2608556513579906E+21},{"$f":"3.14159/12*(+'Constant and Variable Data'!H20+(TRUNC(('Constant and Variable Data'!G20-(2*0)-'Constant and Variable Data'!H20)/(1.9*'Constant and Variable Data'!E20))*(0.95*'Constant and Variable Data'!E20)))*TRUNC(('Constant and Variable Data'!G20-2*0-'Constant and Variable Data'!H20)/(1.9*'Constant and Variable Data'!E20))*TRUNC(0.85*'Constant and Variable Data'!I20/'Constant and Variable Data'!E20)/K24","v":1.2608556513579906E+21},{"$f":"3.14159/12*(+'Constant and Variable Data'!H20+(TRUNC(('Constant and Variable Data'!G20-(2*0)-'Constant and Variable Data'!H20)/(1.9*'Constant and Variable Data'!F20))*(0.95*'Constant and Variable Data'!F20)))*TRUNC(('Constant and Variable Data'!G20-2*0-'Constant and Variable Data'!H20)/(1.9*'Constant and Variable Data'!F20))*TRUNC(0.85*'Constant and Variable Data'!J20/'Constant and Variable Data'!F20)","v":4.0336362129898262E+20}]
[null,"Selected Wire Diameter Compartment #1","Selected Wire Diameter Compartment #2","Selected Wire Diameter Compartment #3","Selected Wire Diameter Compartment #4","Selected Wire Diameter Compartment #5","Flange","Drum","Conductor Traverse","Ground Traverse","Count","Length 1 Entered",{"$f":"'1+1 Estimator'!D21","v":0},{"$f":"'1+1 Estimator'!E21","v":0},{"$f":"'1+1 Estimator'!F21","v":0},{"$f":"'1+1 Estimator'!G21","v":0},{"$f":"'1+1 Estimator'!H21","v":0}]
["Wire Diameter",{"$f":"VLOOKUP('1+1 Estimator'!D19,'Wire Types'!E1:G154,2,FALSE)","v":1.0000000000000001E-9},{"$f":"VLOOKUP('1+1 Estimator'!E19,'Wire Types'!E1:G154,2,FALSE)","v":1.0000000000000001E-9},{"$f":"VLOOKUP('1+1 Estimator'!F19,'Wire Types'!E1:G154,2,FALSE)","v":1.0000000000000001E-9},{"$f":"VLOOKUP('1+1 Estimator'!G19,'Wire Types'!E1:G154,2,FALSE)","v":1.0000000000000001E-9},{"$f":"VLOOKUP('1+1 Estimator'!H19,'Wire Types'!E1:G154,2,FALSE)","v":1.0000000000000001E-9},40,16,16.02,5.125,{"$f":"COUNT('1+1 Estimator'!D21:G21)","v":0},"% Occupied by 1",{"$f":"SUM(M19/M18)","v":0},0,0,0,0]
{"$rows_left_out":11}